{"text_format":"1","workbook":"xlsx","n_sheets":3,"sheets":["Menu","LTVs","Rates"],"not_rendered":{"charts":0,"images":1,"macros":1,"external_links":0,"defined_names":17,"comments":0,"pivot_tables":0},"unopened":[],"bounds":{"document_bytes":16777216,"sheet_cells":100000,"rows_first":2000,"rows_last":500,"rows_between":2000,"halvings":0,"cell_chars":16384,"cell_head_chars":4096},"cells_cut":0,"cells_raw":0,"read":"whole","date_system":"1900"}

{"sheet":"Menu","index":0,"n_rows":82,"n_cols":28,"rows_kept":82,"cut":false,"hidden":false,"merged":[[11,14,16,15],[10,14,10,15],[20,3,20,6],[10,7,10,8],[10,10,10,12],[11,10,11,11],[13,10,13,11],[14,10,14,11],[18,10,18,11],[12,10,12,11],[16,10,16,12]]}
[null,null,null,null,null,null,null,"Single",1,null,"Cashback options"]
[null,null,null,null,null,null,null,"Joint",2,null,"Yes"]
[null,null,null,null,null,null,null,"Min value",70000,null,"No",{"$f":"IF($M$15=\"No\",INDEX(#REF!,MATCH(1,#REF!,0)),\" \")","v":" "}]
[null,null,null,null,null,null,null,"Max value",100000000]
[null,null,null,null,null,null,null,"Youngest",55,{"$f":"YEAR(TODAY())-I5","v":1964}]
[null,null,null,null,null,null,null,"Oldest",90,{"$f":"YEAR(TODAY())-I6","v":1929}]
[null,null,null,null,null,null,null,"Age1",{"$f":"IF(LEN($I$13)>2,DATEDIF($I$13,TODAY(),\"y\"),$I$13)","v":0},{"$f":"AND(_xlfn.NUMBERVALUE(app1Age)>=$I$5,_xlfn.NUMBERVALUE(app1Age)<=$I$6)","v":false}]
[null,null,null,null,null,null,null,"Age2",{"$f":"IF(LEN($I$14)>2,DATEDIF($I$14,TODAY(),\"y\"),$I$14)","v":0},{"$f":"AND(_xlfn.NUMBERVALUE(app2Age)>=$I$5,_xlfn.NUMBERVALUE(app2Age)<=$I$6)","v":false}]
[null,null,null,null,null,null,null,"Youngest age:",{"$f":"IF(AND(App_type=\"Joint\",J8=TRUE,app1Age>=app2Age),app2Age,\nIF(AND(App_type=\"Joint\",J7=TRUE,app2Age>app1Age),app1Age,IF(App_type=\"Single\",app1Age,\nIF(AND(app1Age=0,app2Age=0),\"True\"))))","v":"True"}]
[null,null,null,null,null,null,null,"Zero",0]
[null,null,null,null,null,null,null,"About your client and their needs",null,null,"About the products and their features",null,null,null,"Information"]
[null,null,null,null,null,null,null,"Joint or Single? ",null,null,"Drawdown required? ",null,null,null,{"$f":"IF(AND(ISBLANK(App_type),ISBLANK(M12),ISBLANK(M15),ISBLANK(M17),ISBLANK(M18)),\" \",\nIF(AND(App_type>0,M12>0,M15>0,M17>0,M18>0),\" \",\nIF(propertyValue>6000000,HYPERLINK(\"mailto:info@pureretirement.co.uk\",\"Click HERE to reffer the property to us prior creating a KFI\"),\nIF(AND($I$12=\"Single\",OR(ISBLANK($M$12),ISBLANK($M$15),ISBLANK($M$17),ISBLANK($M$18))),\"To find the best product that fits your customer's needs please apply secondary filters in 'About the products and their features' section\",\nIF(AND($I$12=\"Joint\",OR(ISBLANK($M$12),ISBLANK($M$15),ISBLANK($M$17),ISBLANK($M$18))),\"To find the best product that fits your customers' needs please apply secondary filters in 'About the products and their features' section\"\n)))))","v":" "}]
[null,null,null,null,null,null,null,"Age or DOB of App1 ",null,{"$f":"IF(LEN(I13)>2,DATEDIF(I13,TODAY(),\"y\")&\" yrs \"&DATEDIF(I13,TODAY(),\"ym\")& \" mnths\",\" \")","v":" "},"Amount of Drawdown Required: "]
[null,null,null,null,null,null,null,"Age or DOB of App2 ",null,{"$f":"IF(LEN(I14)>2,DATEDIF(I14,TODAY(),\"y\")&\" yrs \"&DATEDIF(I14,TODAY(),\"ym\")& \" mnths\",\" \")","v":" "}]
[null,null,null,null,null,null,null,"Gender of App1 "]
[null,null,null,null,null,null,null,"Gender of App2 "]
[null,null,null,null,null,null,null,"Property value ",null,null,"Contribution to advice fee & Cashback? "]
[null,null,null,null,null,null,null,"Loan priority ",null,{"$f":"IF(I18=\"Lowest interest rate\",\"Rate\",\"Release\")","v":"Release"}]
[null,null,null,null,null,null,null,"Loan required ",null,null,{"$f":"IF(OR(ISBLANK(App_type),ISBLANK(propertyValue),youngestAge=0),\" \",\"Maximum loan: \")","v":" "},null,{"$f":"IF(OR(ISBLANK(App_type),ISBLANK(propertyValue),youngestAge=0),\" \",MAX(Products[Max loan]))","v":" "}]
[]
{"$rows_left_out":63}
{"sheet":"LTVs","index":1,"n_rows":38,"n_cols":14,"rows_kept":38,"cut":false,"hidden":true,"merged":[[0,12,0,13],[0,10,0,11],[0,0,1,0],[0,1,1,1],[0,2,0,3],[0,4,0,5],[0,6,0,7],[0,8,0,9]]}
["Age","DOB","A",null,"B",null,"C",null,"D",null,"E",null,"F"]
[null,null,"S","J","S","J","S","J","S","J","S","J","S","J"]
["55",{"$f":"YEAR(TODAY())-A3","v":1964},8.5000000000000006E-2,8.5000000000000006E-2,0.13500000000000001,0.13500000000000001,0.18,0.18,0,0,0,0,0,0]
["56",{"$f":"YEAR(TODAY())-A4","v":1963},9.5000000000000001E-2,9.5000000000000001E-2,0.14499999999999999,0.14499999999999999,0.19,0.19,0,0,0,0,0,0]
["57",1962,0.105,0.105,0.155,0.155,0.2,0.2,0,0,0,0,0,0]
["58",1961,0.115,0.115,0.16500000000000001,0.16500000000000001,0.21,0.19999999999999998,0,0,0,0,0,0]
["59",1960,0.125,0.125,0.17499999999999999,0.16999999999999998,0.22,0.20500000000000002,0,0,0,0,0,0]
["60",1959,0.13500000000000001,0.13,0.185,0.16999999999999998,0.23,0.20500000000000002,0.28000000000000003,0.24500000000000002,0.31,0.27,0.32,0.28000000000000003]
["61",1958,0.14499999999999999,0.13999999999999999,0.19500000000000001,0.18,0.24,0.215,0.28999999999999998,0.255,0.32,0.28000000000000003,0.33,0.28999999999999998]
["62",1957,0.155,0.14499999999999999,0.20499999999999999,0.19,0.25,0.22500000000000001,0.3,0.26500000000000001,0.33,0.29000000000000004,0.34,0.3]
["63",1956,0.16500000000000001,0.155,0.215,0.19500000000000001,0.26,0.23500000000000001,0.31,0.27500000000000002,0.34,0.30000000000000004,0.35,0.31]
["64",1955,0.17499999999999999,0.16499999999999998,0.22500000000000001,0.20500000000000002,0.27,0.24500000000000002,0.32,0.28500000000000003,0.35,0.31,0.36,0.32]
["65",1954,0.185,0.17499999999999999,0.23499999999999999,0.215,0.28000000000000003,0.25,0.33,0.29500000000000004,0.36,0.32,0.37,0.33]
["66",1953,0.19500000000000001,0.185,0.245,0.22500000000000001,0.28999999999999998,0.26,0.34,0.30500000000000005,0.37,0.33,0.38,0.34]
["67",1952,0.20499999999999999,0.19499999999999998,0.255,0.23500000000000001,0.3,0.27,0.35,0.31499999999999995,0.38,0.34,0.39,0.35]
["68",1951,0.215,0.20499999999999999,0.26500000000000001,0.24500000000000002,0.31,0.28000000000000003,0.36,0.32499999999999996,0.39,0.35000000000000003,0.4,0.36]
["69",1950,0.22500000000000001,0.215,0.27500000000000002,0.255,0.32,0.29000000000000004,0.37,0.33499999999999996,0.4,0.36000000000000004,0.41,0.37]
["70",1949,0.23499999999999999,0.22499999999999998,0.28499999999999998,0.26499999999999996,0.33,0.30000000000000004,0.38,0.34499999999999997,0.41,0.37,0.42,0.38]
["71",1948,0.245,0.23499999999999999,0.29499999999999998,0.27499999999999997,0.34,0.315,0.39,0.35499999999999998,0.42,0.38500000000000001,0.43,0.39500000000000002]
["72",1947,0.255,0.245,0.30499999999999999,0.28499999999999998,0.35,0.32499999999999996,0.4,0.36499999999999999,0.43,0.39500000000000002,0.44,0.40500000000000003]
{"$rows_left_out":19}
{"sheet":"Rates","index":2,"n_rows":14,"n_cols":10,"rows_kept":14,"cut":false,"hidden":true,"merged":[]}
["LTV","Base rate","Elite","Standard","Fees Package",1,1.5,0]
["A",2.9100000000000001E-2,5.0000000000000001E-3,0,3.0000000000000001E-3,1E-3,1.5E-3,2E-3]
["B",3.0200000000000001E-2,5.0000000000000001E-3,0,3.0000000000000001E-3,1E-3,1.5E-3,2E-3]
["C",3.5900000000000001E-2,5.0000000000000001E-3,0,3.0000000000000001E-3,1E-3,1.5E-3,2E-3]
["D",4.7500000000000001E-2,5.0000000000000001E-3,0,3.0000000000000001E-3,1E-3,1.5E-3,2E-3]
["E",5.62E-2,5.0000000000000001E-3,0,3.0000000000000001E-3,1E-3,1.5E-3,2E-3]
["F",6.2899999999999998E-2,5.0000000000000001E-3,0,3.0000000000000001E-3,1E-3,1.5E-3,2E-3]
[]
[]
[]
[]
[]
[]
[null,null,null,null,null,null,null,null,null,6.6E-3]